BDBM1717 US8470837, 21
SMILES Cn1c2ncn(C[C@H](O)CO)c(=O)c2c(Nc2ccc(cc2F)C#N)c(F)c1=O
InChI Key InChIKey=SIQPPFUZXXNPJR-JTQLQIEISA-N
Data  1 IC50
  Tab Delimited (TSV)   2D SDfile   Computed 3D by Vconf -m prep SDfile
Find this compound or compounds like it in BindingDB:
Activity Spreadsheet -- Enzyme Inhibition Constant Data from BindingDB
Found 1 hit for monomerid = 1717
TargetDual specificity mitogen-activated protein kinase kinase 1 [2-31,52-393,S218E,S222D](Homo sapiens (Human))
Takeda Pharmaceutical
US Patent
LigandPNGBDBM1717(US8470837, 21)
Affinity DataIC50:  10nMpH: 7.3 T: 2°C. Assay description: Reaction product is determined quantitatively by fluorescent polarization using progressive IMAP beads from Molecular Devices.
In DepthDetails US Patent